Reaction Details
TargetProteasome subunit beta type-8
LigandBDBM50554385
Substrate/Competitorn/a
Meas. Tech.ChEMBL_2049561 (CHEMBL4704260)
IC50 1.5±n/a nM
Citation Zhan, WSingh, PKBan, YQing, XAh Kioon, MDFan, HZhao, QWang, RSukenick, GSalmon, JWarren, JDMa, XBarrat, FJNathan, CFLin, G Structure-Activity Relationships of Noncovalent Immunoproteasome ?5i-Selective Dipeptides. J Med Chem63:13103-13123 (2020) 
 
Proteasome subunit beta type-8
Name:Proteasome subunit beta type-8
Type:PROTEIN
Mol. Mass.:30357.49
Organism:Homo sapiens (Human)
Description:ChEMBL_1446797
Residue:276
BDBM50554385
NameBDBM50554385
Synonyms:CHEMBL4764897
TypeSmall organic molecule
Emp. Form.C32H40N4O4
Mol. Mass.544.6844
SMILESC[C@H](NC(=O)[C@H](CCC(=O)NC(C)(C)C)NC(=O)CCc1ccccc1)C(=O)NCc1cccc2ccccc12