Reaction Details
TargetProteasome subunit beta type-8
LigandBDBM50554386
Substrate/Competitorn/a
Meas. Tech.ChEMBL_2049561 (CHEMBL4704260)
IC50 1.6±n/a nM
Citation Zhan, WSingh, PKBan, YQing, XAh Kioon, MDFan, HZhao, QWang, RSukenick, GSalmon, JWarren, JDMa, XBarrat, FJNathan, CFLin, G Structure-Activity Relationships of Noncovalent Immunoproteasome ?5i-Selective Dipeptides. J Med Chem63:13103-13123 (2020) 
 
Proteasome subunit beta type-8
Name:Proteasome subunit beta type-8
Type:PROTEIN
Mol. Mass.:30357.49
Organism:Homo sapiens (Human)
Description:ChEMBL_1446797
Residue:276
BDBM50554386
NameBDBM50554386
Synonyms:CHEMBL4758484
TypeSmall organic molecule
Emp. Form.C32H39FN4O4
Mol. Mass.562.6749
SMILESC[C@H](NC(=O)[C@H](CCC(=O)NC(C)(C)C)NC(=O)CCc1ccccc1)C(=O)NCc1ccc(F)c2ccccc12