Reaction Details
TargetProteasome subunit beta type-8
LigandBDBM50554389
Substrate/Competitorn/a
Meas. Tech.ChEMBL_2049561 (CHEMBL4704260)
IC50 1.2±n/a nM
Citation Zhan, WSingh, PKBan, YQing, XAh Kioon, MDFan, HZhao, QWang, RSukenick, GSalmon, JWarren, JDMa, XBarrat, FJNathan, CFLin, G Structure-Activity Relationships of Noncovalent Immunoproteasome ?5i-Selective Dipeptides. J Med Chem63:13103-13123 (2020) 
 
Proteasome subunit beta type-8
Name:Proteasome subunit beta type-8
Type:PROTEIN
Mol. Mass.:30357.49
Organism:Homo sapiens (Human)
Description:ChEMBL_1446797
Residue:276
BDBM50554389
NameBDBM50554389
Synonyms:CHEMBL4796570
TypeSmall organic molecule
Emp. Form.C28H34FN5O5
Mol. Mass.539.5985
SMILESC[C@H](NC(=O)[C@H](CCC(=O)NC(C)(C)C)NC(=O)c1cc(C)on1)C(=O)NCc1ccc(F)c2ccccc12