Reaction Details
TargetProteasome subunit beta type-8
LigandBDBM50554394
Substrate/Competitorn/a
Meas. Tech.ChEMBL_2049561 (CHEMBL4704260)
IC50 0.400000±n/a nM
Citation Zhan, WSingh, PKBan, YQing, XAh Kioon, MDFan, HZhao, QWang, RSukenick, GSalmon, JWarren, JDMa, XBarrat, FJNathan, CFLin, G Structure-Activity Relationships of Noncovalent Immunoproteasome ?5i-Selective Dipeptides. J Med Chem63:13103-13123 (2020) 
 
Proteasome subunit beta type-8
Name:Proteasome subunit beta type-8
Type:PROTEIN
Mol. Mass.:30357.49
Organism:Homo sapiens (Human)
Description:ChEMBL_1446797
Residue:276
BDBM50554394
NameBDBM50554394
Synonyms:CHEMBL4784875
TypeSmall organic molecule
Emp. Form.C30H38N4O5S
Mol. Mass.566.712
SMILESC[C@H](NC(=O)[C@H](CCC(=O)NC(C)(C)C)NS(=O)(=O)c1ccc(C)cc1)C(=O)NCc1cccc2ccccc12