Reaction Details
TargetC-C chemokine receptor type 5
LigandBDBM50106995
Substrate/Competitorn/a
Meas. Tech.ChEMBL_39513 (CHEMBL654810)
IC50 0.3±n/a nM
Citation Hale, JJBudhu, RJMills, SGMacCoss, MGould, SLDeMartino, JASpringer, MSSiciliano, SJMalkowitz, LSchleif, WAHazuda, DMiller, MKessler, JDanzeisen, RHolmes, KLineberger, JCarella, ACarver, GEmini, EA 1,3,4-Trisubstituted pyrrolidine CCR5 receptor antagonists. Part 3: polar functionality and its effect on anti-HIV-1 activity. Bioorg Med Chem Lett12:2997-3000 (2002) C-C chemokine receptor type 5
Name:C-C chemokine receptor type 5
Type:Enzyme
Mol. Mass.:40540.21
Organism:Homo sapiens (Human)
Description:P51681
Residue:352
BDBM50106995
NameBDBM50106995
Synonyms:1-((3S,4S)-1-Cyclohexylmethyl-4-phenyl-pyrrolidin-3-ylmethyl)-4-(3-phenyl-propyl)-piperidin-4-ol CHEMBL317710
TypeSmall organic molecule
Emp. Form.C32H46N2O
Mol. Mass.474.7204
SMILESOC1(CCCc2ccccc2)CCN(C[C@H]2CN(CC3CCCCC3)C[C@@H]2c2ccccc2)CC1