Reaction Details
TargetHistamine H1 receptor
LigandBDBM50404001
Substrate/Competitorn/a
Meas. Tech.ChEBML_84425
Ki 20000±n/a nM
Citation Vasudevan, AConner, SEGentles, RGFaghih, RLiu, HDwight, WIreland, LKang, CHEsbenshade, TABennani, YLHancock, AA Synthesis and evaluation of potent pyrrolidine H(3) antagonists. Bioorg Med Chem Lett12:3055-8 (2002) Histamine H1 receptor
Name:Histamine H1 receptor
Type:G Protein-Coupled Receptor (GPCR)
Mol. Mass.:55808.72
Organism:Homo sapiens (Human)
Description:Cell pellets from SK-N-MC cells transfected with human H1 receptor were used in binding assay.
Residue:487
BDBM50404001
NameBDBM50404001
Synonyms:CHEMBL2112451
TypeSmall organic molecule
Emp. Form.C24H27N3O4S
Mol. Mass.453.554
SMILESO=C(C1CC1)c1ccc(OCCCN2CC[C@@H](C2)NS(=O)(=O)c2ccc(cc2)C#N)cc1