Reaction Details
TargetHistamine H3 receptor
LigandBDBM50119707
Substrate/Competitorn/a
Meas. Tech.ChEMBL_87253 (CHEMBL699243)
Ki 2±n/a nM
Citation Vasudevan, AConner, SEGentles, RGFaghih, RLiu, HDwight, WIreland, LKang, CHEsbenshade, TABennani, YLHancock, AA Synthesis and evaluation of potent pyrrolidine H(3) antagonists. Bioorg Med Chem Lett12:3055-8 (2002) Histamine H3 receptor
Name:Histamine H3 receptor
Type:G Protein-Coupled Receptor (GPCR)
Mol. Mass.:48607.98
Organism:Rattus norvegicus (rat)
Description:n/a
Residue:445
BDBM50119707
NameBDBM50119707
Synonyms:4-[3-(4-Hexanoyl-phenoxy)-propyl]-piperazine-1-carboxylic acid ethyl ester A-923 | CHEMBL62803
TypeSmall organic molecule
Emp. Form.C22H34N2O4
Mol. Mass.390.5164
SMILESCCCCCC(=O)c1ccc(OCCCN2CCN(CC2)C(=O)OCC)cc1