Reaction Details
TargetHistamine H1 receptor
LigandBDBM50119710
Substrate/Competitorn/a
Meas. Tech.ChEBML_84425
Ki 9400±n/a nM
Citation Vasudevan, AConner, SEGentles, RGFaghih, RLiu, HDwight, WIreland, LKang, CHEsbenshade, TABennani, YLHancock, AA Synthesis and evaluation of potent pyrrolidine H(3) antagonists. Bioorg Med Chem Lett12:3055-8 (2002) Histamine H1 receptor
Name:Histamine H1 receptor
Type:G Protein-Coupled Receptor (GPCR)
Mol. Mass.:55808.72
Organism:Homo sapiens (Human)
Description:Cell pellets from SK-N-MC cells transfected with human H1 receptor were used in binding assay.
Residue:487
BDBM50119710
NameBDBM50119710
Synonyms:CHEMBL104618 | N-{(S)-1-[3-(4-Cyclopropanecarbonyl-phenoxy)-propyl]-pyrrolidin-3-yl}-2-fluoro-benzenesulfonamide
TypeSmall organic molecule
Emp. Form.C23H27FN2O4S
Mol. Mass.446.535
SMILESFc1ccccc1S(=O)(=O)N[C@H]1CCN(CCCOc2ccc(cc2)C(=O)C2CC2)C1