Reaction Details
TargetHistamine H3 receptor
LigandBDBM50119698
Substrate/Competitorn/a
Meas. Tech.ChEBML_87253
Ki 10±n/a nM
Citation Vasudevan, AConner, SEGentles, RGFaghih, RLiu, HDwight, WIreland, LKang, CHEsbenshade, TABennani, YLHancock, AA Synthesis and evaluation of potent pyrrolidine H(3) antagonists. Bioorg Med Chem Lett12:3055-8 (2002) Histamine H3 receptor
Name:Histamine H3 receptor
Type:G Protein-Coupled Receptor (GPCR)
Mol. Mass.:48607.98
Organism:Rattus norvegicus (rat)
Description:n/a
Residue:445
BDBM50119698
NameBDBM50119698
Synonyms:1-Methyl-1H-imidazole-4-sulfonic acid {(S)-1-[3-(4-cyclopropanecarbonyl-phenoxy)-propyl]-pyrrolidin-3-yl}-amide | CHEMBL322678
TypeSmall organic molecule
Emp. Form.C21H28N4O4S
Mol. Mass.432.536
SMILESCn1cnc(c1)S(=O)(=O)N[C@H]1CCN(CCCOc2ccc(cc2)C(=O)C2CC2)C1