Reaction Details
TargetHistamine H2 receptor
LigandBDBM50119722
Substrate/Competitorn/a
Meas. Tech.ChEBML_85525
Ki 1000±n/a nM
Citation Vasudevan, AConner, SEGentles, RGFaghih, RLiu, HDwight, WIreland, LKang, CHEsbenshade, TABennani, YLHancock, AA Synthesis and evaluation of potent pyrrolidine H(3) antagonists. Bioorg Med Chem Lett12:3055-8 (2002) Histamine H2 receptor
Name:Histamine H2 receptor
Type:G Protein-Coupled Receptor (GPCR)
Mol. Mass.:40115.31
Organism:Homo sapiens (Human)
Description:n/a
Residue:359
BDBM50119722
NameBDBM50119722
Synonyms:CHEMBL107162 | N-{(S)-1-[3-(4-Cyclopropanecarbonyl-phenoxy)-propyl]-pyrrolidin-3-yl}-4-methoxy-benzenesulfonamide
TypeSmall organic molecule
Emp. Form.C24H30N2O5S
Mol. Mass.458.57
SMILESCOc1ccc(cc1)S(=O)(=O)N[C@H]1CCN(CCCOc2ccc(cc2)C(=O)C2CC2)C1