Reaction Details
TargetHistamine H1 receptor
LigandBDBM50119706
Substrate/Competitorn/a
Meas. Tech.ChEBML_84425
Ki 11000±n/a nM
Citation Vasudevan, AConner, SEGentles, RGFaghih, RLiu, HDwight, WIreland, LKang, CHEsbenshade, TABennani, YLHancock, AA Synthesis and evaluation of potent pyrrolidine H(3) antagonists. Bioorg Med Chem Lett12:3055-8 (2002) Histamine H1 receptor
Name:Histamine H1 receptor
Type:G Protein-Coupled Receptor (GPCR)
Mol. Mass.:55808.72
Organism:Homo sapiens (Human)
Description:Cell pellets from SK-N-MC cells transfected with human H1 receptor were used in binding assay.
Residue:487
BDBM50119706
NameBDBM50119706
Synonyms:2-Pyridin-3-yl-thiazole-4-carboxylic acid {(S)-1-[3-(4-acetyl-phenoxy)-propyl]-pyrrolidin-3-yl}-amide | CHEMBL101634
TypeSmall organic molecule
Emp. Form.C24H26N4O3S
Mol. Mass.450.553
SMILESCC(=O)c1ccc(OCCCN2CC[C@@H](C2)NC(=O)c2csc(n2)-c2cccnc2)cc1