Reaction Details
TargetHistamine H3 receptor
LigandBDBM50119738
Substrate/Competitorn/a
Meas. Tech.ChEBML_87253
Ki 10000±n/a nM
Citation Vasudevan, AConner, SEGentles, RGFaghih, RLiu, HDwight, WIreland, LKang, CHEsbenshade, TABennani, YLHancock, AA Synthesis and evaluation of potent pyrrolidine H(3) antagonists. Bioorg Med Chem Lett12:3055-8 (2002) Histamine H3 receptor
Name:Histamine H3 receptor
Type:G Protein-Coupled Receptor (GPCR)
Mol. Mass.:48607.98
Organism:Rattus norvegicus (rat)
Description:n/a
Residue:445
BDBM50119738
NameBDBM50119738
Synonyms:1-{(1S,4S)-5-[3-(4-Cyclopropanecarbonyl-phenoxy)-propyl]-2,5-diaza-bicyclo[2.2.1]hept-2-yl}-3,3-dimethyl-butan-1-one | CHEMBL101584
TypeSmall organic molecule
Emp. Form.C24H34N2O3
Mol. Mass.398.5384
SMILESCC(C)(C)CC(=O)N1C[C@@H]2C[C@H]1CN2CCCOc1ccc(cc1)C(=O)C1CC1