Reaction Details
TargetGenome polyprotein/Non-structural protein 4A
LigandBDBM50120021
Substrate/Competitorn/a
Meas. Tech.ChEMBL_143656 (CHEMBL752815)
Ki 1360±n/a nM
Citation Sperandio, DGangloff, ARLitvak, JGoldsmith, RHataye, JMWang, VRShelton, EJElrod, KJanc, JWClark, JMRice, KWeinheimer, SYeung, KSMeanwell, NAHernandez, DStaab, AJVenables, BLSpencer, JR Highly potent non-peptidic inhibitors of the HCV NS3/NS4A serine protease. Bioorg Med Chem Lett12:3129-33 (2002) Genome polyprotein/Non-structural protein 4A
Name:Genome polyprotein/Non-structural protein 4A
Synonyms:Hepatitis C virus serine protease, NS3/NS4A
Type:n/a
Mol. Mass.:n/a
Description:ASSAY_ID of ChEMBL is 1969955
Components:This complex has 2 components.
Component 1
Name:Non-structural protein 4A
Type:PROTEIN
Mol. Mass.:5762.65
Organism:Hepatitis C virus
Description:ChEMBL_305334
Residue:54
Component 2
Name:Genome polyprotein
Synonyms:Hepatitis C virus NS3 protease/helicase | Hepatitis C virus serine protease, NS3/NS4A
Type:Protein
Mol. Mass.:67067.41
Organism:Hepatitis C virus
Description:A3EZI9
Residue:631
BDBM50120021
NameBDBM50120021
Synonyms:2-{[2-(6-Carbamoyl-1H-benzoimidazol-2-ylmethyl)-3-methyl-3H-benzoimidazole-5-carbonyl]-amino}-3-(hydroxy-methoxy-phosphoryl)-propionic acid | CHEMBL104014
TypeSmall organic molecule
Emp. Form.C22H23N6O7P
Mol. Mass.514.4278
SMILESCOP(O)(=O)CC(NC(=O)c1ccc2nc(Cc3nc4ccc(cc4[nH]3)C(N)=O)n(C)c2c1)C(O)=O