Reaction Details
TargetGag-Pol polyprotein [489-587]
LigandBDBM50121970
Substrate/Competitorn/a
Meas. Tech.ChEMBL_159620 (CHEMBL760101)
IC50>90000±n/a nM
Citation Neamati, NLin, ZKarki, RGOrr, ACowansage, KStrumberg, DPais, GCVoigt, JHNicklaus, MCWinslow, HEZhao, HTurpin, JAYi, JSkalka, AMBurke, TRPommier, Y Metal-dependent inhibition of HIV-1 integrase. J Med Chem45:5661-70 (2002) Gag-Pol polyprotein [489-587]
Name:Gag-Pol polyprotein [489-587]
Type:Enzyme Subunit
Mol. Mass.:10781.16
Organism:Human immunodeficiency virus type 1
Description:P04585[489-587]
Residue:99
BDBM50121970
NameBDBM50121970
Synonyms:11,12,13,14,25,26,27,28-octahydrotetrabenzo[c,i,m,s][1,2,11,12,6,7,16,17]tetrathiatetraazacycloicosine-11,14,25,28-tetraone | CHEMBL152850
TypeSmall organic molecule
Emp. Form.C28H20N4O4S4
Mol. Mass.604.743
SMILESO=C1NNC(=O)c2ccccc2SSc2ccccc2C(=O)NNC(=O)c2ccccc2SSc2ccccc12