Reaction Details
TargetReverse transcriptase/RNaseH
LigandBDBM50121972
Substrate/Competitorn/a
Meas. Tech.ChEMBL_195519 (CHEMBL800587)
IC50>100000±n/a nM
Citation Neamati, NLin, ZKarki, RGOrr, ACowansage, KStrumberg, DPais, GCVoigt, JHNicklaus, MCWinslow, HEZhao, HTurpin, JAYi, JSkalka, AMBurke, TRPommier, Y Metal-dependent inhibition of HIV-1 integrase. J Med Chem45:5661-70 (2002) Reverse transcriptase/RNaseH
Name:Reverse transcriptase/RNaseH
Type:PROTEIN
Mol. Mass.:65229.15
Organism:Human immunodeficiency virus 1
Description:ChEMBL_1473730
Residue:566
BDBM50121972
NameBDBM50121972
Synonyms:CHEMBL157373 | Compound 3
TypeSmall organic molecule
Emp. Form.C28H22N4O4S4
Mol. Mass.606.759
SMILESSc1ccccc1C(=O)NNC(=O)c1ccccc1SSc1ccccc1C(=O)NNC(=O)c1ccccc1S