Reaction Details
TargetAmine oxidase [flavin-containing] B
LigandBDBM50122955
Substrate/Competitorn/a
Meas. Tech.ChEMBL_124426 (CHEMBL874045)
IC50 200±n/a nM
Citation Musso, DLCochran, FRKelley, JLMcLean, EWSelph, JLRigdon, GCOrr, GFDavis, RGCooper, BRStyles, VLThompson, JBHall, WR Indanylidenes. 1. Design and synthesis of (E)-2-(4,6-difluoro-1-indanylidene)acetamide, a potent, centrally acting muscle relaxant with antiinflammatory and analgesic activity. J Med Chem46:399-408 (2003) 
 
Amine oxidase [flavin-containing] B
Name:Amine oxidase [flavin-containing] B
Type:Protein
Mol. Mass.:58768.76
Organism:Homo sapiens (Human)
Description:P27338
Residue:520
BDBM50122955
NameBDBM50122955
Synonyms:2-(4,6-Difluoro-indan-1-ylidene)-acetamide | CHEMBL130217
TypeSmall organic molecule
Emp. Form.C11H9F2NO
Mol. Mass.209.1921
SMILESNC(=O)\C=C1/CCc2c1cc(F)cc2F