Reaction Details
TargetNeuropeptide Y receptor type 5
LigandBDBM50123724
Substrate/Competitorn/a
Meas. Tech.ChEMBL_144130 (CHEMBL750103)
Ki 7.30±n/a nM
Citation Sato, NTakahashi, TShibata, THaga, YSakuraba, AHirose, MSato, MNonoshita, KKoike, YKitazawa, HFujino, NIshii, YIshihara, AKanatani, AFukami, T Design and synthesis of the potent, orally available, brain-penetrable arylpyrazole class of neuropeptide Y5 receptor antagonists. J Med Chem46:666-9 (2003) 
 
Neuropeptide Y receptor type 5
Name:Neuropeptide Y receptor type 5
Type:Enzyme
Mol. Mass.:50746.64
Organism:Homo sapiens (Human)
Description:Q15761
Residue:445
BDBM50123724
NameBDBM50123724
Synonyms:2,3-Dihydro-1H-cyclopenta[a]naphthalene-2-carboxylic acid [5-(2-ethyl-pyridin-4-yl)-1H-pyrazol-3-yl]-amide | CHEMBL422012
TypeSmall organic molecule
Emp. Form.C24H22N4O
Mol. Mass.382.4577
SMILESCCc1cc(ccn1)-c1cc(NC(=O)C2Cc3ccc4ccccc4c3C2)[nH]n1