Reaction Details
TargetNeuropeptide Y receptor type 5
LigandBDBM50123727
Substrate/Competitorn/a
Meas. Tech.ChEMBL_144130 (CHEMBL750103)
Ki 80±n/a nM
Citation Sato, NTakahashi, TShibata, THaga, YSakuraba, AHirose, MSato, MNonoshita, KKoike, YKitazawa, HFujino, NIshii, YIshihara, AKanatani, AFukami, T Design and synthesis of the potent, orally available, brain-penetrable arylpyrazole class of neuropeptide Y5 receptor antagonists. J Med Chem46:666-9 (2003) 
 
Neuropeptide Y receptor type 5
Name:Neuropeptide Y receptor type 5
Type:Enzyme
Mol. Mass.:50746.64
Organism:Homo sapiens (Human)
Description:Q15761
Residue:445
BDBM50123727
NameBDBM50123727
Synonyms:CHEMBL158759 | Indan-2-carboxylic acid (5-p-tolyl-1H-pyrazol-3-yl)-amide
TypeSmall organic molecule
Emp. Form.C20H19N3O
Mol. Mass.317.3844
SMILESCc1ccc(cc1)-c1cc(NC(=O)C2Cc3ccccc3C2)[nH]n1