Reaction Details
TargetTyrosine-protein kinase Lck
LigandBDBM50131119
Substrate/Competitorn/a
Meas. Tech.ChEBML_221493
IC50 13±n/a nM
Citation Das, JMoquin, RVLin, JLiu, CDoweyko, AMDeFex, HFFang, QPang, SPitt, SShen, DRSchieven, GLBarrish, JCWityak, J Discovery of 2-amino-heteroaryl-benzothiazole-6-anilides as potent p56(lck) inhibitors. Bioorg Med Chem Lett13:2587-90 (2003) Tyrosine-protein kinase Lck
Name:Tyrosine-protein kinase Lck
Type:n/a
Mol. Mass.:57987.83
Organism:Homo sapiens (Human)
Description:P06239
Residue:509
BDBM50131119
NameBDBM50131119
Synonyms:2-(6-Morpholin-4-ylmethyl-pyridin-2-ylamino)-benzothiazole-6-carboxylic acid (2-chloro-6-methyl-phenyl)-amide | CHEMBL86742
TypeSmall organic molecule
Emp. Form.C25H24ClN5O2S
Mol. Mass.494.008
SMILESCc1cccc(Cl)c1NC(=O)c1ccc2nc(Nc3cccc(CN4CCOCC4)n3)sc2c1