Reaction Details
TargetTyrosine-protein kinase Lck
LigandBDBM50131123
Substrate/Competitorn/a
Meas. Tech.ChEBML_221493
IC50 5±n/a nM
Citation Das, JMoquin, RVLin, JLiu, CDoweyko, AMDeFex, HFFang, QPang, SPitt, SShen, DRSchieven, GLBarrish, JCWityak, J Discovery of 2-amino-heteroaryl-benzothiazole-6-anilides as potent p56(lck) inhibitors. Bioorg Med Chem Lett13:2587-90 (2003) Tyrosine-protein kinase Lck
Name:Tyrosine-protein kinase Lck
Type:n/a
Mol. Mass.:57987.83
Organism:Homo sapiens (Human)
Description:P06239
Residue:509
BDBM50131123
NameBDBM50131123
Synonyms:2-(4-Ethyl-pyridin-2-ylamino)-benzothiazole-6-carboxylic acid (2-chloro-6-methyl-phenyl)-amide | CHEMBL86338
TypeSmall organic molecule
Emp. Form.C22H19ClN4OS
Mol. Mass.422.93
SMILESCCc1ccnc(Nc2nc3ccc(cc3s2)C(=O)Nc2c(C)cccc2Cl)c1