Reaction Details
TargetTyrosine-protein kinase Fyn
LigandBDBM13357
Substrate/Competitorn/a
Meas. Tech.ChEBML_69451
Ki 2.4±n/a nM
Citation Das, JMoquin, RVLin, JLiu, CDoweyko, AMDeFex, HFFang, QPang, SPitt, SShen, DRSchieven, GLBarrish, JCWityak, J Discovery of 2-amino-heteroaryl-benzothiazole-6-anilides as potent p56(lck) inhibitors. Bioorg Med Chem Lett13:2587-90 (2003) Tyrosine-protein kinase Fyn
Name:Tyrosine-protein kinase Fyn
Type:Enzyme
Mol. Mass.:60762.21
Organism:Homo sapiens (Human)
Description:P06241
Residue:537
BDBM13357
NameBDBM13357
Synonyms:CHEMBL312933 benzothiazole analog 13a
TypeSmall Organic Molecule
Emp. Form.C22H20ClN5O2S
Mol. Mass.453.945
SMILESCc1cccc(Cl)c1NC(=O)c1ccc2nc(Nc3cccc(NCCO)n3)sc2c1