Reaction Details
TargetTyrosine-protein kinase Lck
LigandBDBM50131142
Substrate/Competitorn/a
Meas. Tech.ChEBML_221493
IC50 3±n/a nM
Citation Das, JMoquin, RVLin, JLiu, CDoweyko, AMDeFex, HFFang, QPang, SPitt, SShen, DRSchieven, GLBarrish, JCWityak, J Discovery of 2-amino-heteroaryl-benzothiazole-6-anilides as potent p56(lck) inhibitors. Bioorg Med Chem Lett13:2587-90 (2003) Tyrosine-protein kinase Lck
Name:Tyrosine-protein kinase Lck
Type:n/a
Mol. Mass.:57987.83
Organism:Homo sapiens (Human)
Description:P06239
Residue:509
BDBM50131142
NameBDBM50131142
Synonyms:2-[2-(2-Hydroxy-ethylamino)-pyrimidin-4-ylamino]-benzothiazole-6-carboxylic acid (2-chloro-6-methyl-phenyl)-amide | CHEMBL431986
TypeSmall organic molecule
Emp. Form.C21H19ClN6O2S
Mol. Mass.454.933
SMILESCc1cccc(Cl)c1NC(=O)c1ccc2nc(Nc3ccnc(NCCO)n3)sc2c1