Reaction Details
TargetTyrosine-protein kinase Lck
LigandBDBM50131171
Substrate/Competitorn/a
Meas. Tech.ChEBML_221493
IC50 5±n/a nM
Citation Das, JMoquin, RVLin, JLiu, CDoweyko, AMDeFex, HFFang, QPang, SPitt, SShen, DRSchieven, GLBarrish, JCWityak, J Discovery of 2-amino-heteroaryl-benzothiazole-6-anilides as potent p56(lck) inhibitors. Bioorg Med Chem Lett13:2587-90 (2003) Tyrosine-protein kinase Lck
Name:Tyrosine-protein kinase Lck
Type:n/a
Mol. Mass.:57987.83
Organism:Homo sapiens (Human)
Description:P06239
Residue:509
BDBM50131171
NameBDBM50131171
Synonyms:2-(6-Ethyl-pyrimidin-4-ylamino)-benzothiazole-6-carboxylic acid (2-chloro-6-methyl-phenyl)-amide | CHEMBL313115
TypeSmall organic molecule
Emp. Form.C21H18ClN5OS
Mol. Mass.423.919
SMILESCCc1cc(Nc2nc3ccc(cc3s2)C(=O)Nc2c(C)cccc2Cl)ncn1