Reaction Details
TargetTyrosine-protein kinase JAK3
LigandBDBM50132424
Substrate/Competitorn/a
Meas. Tech.ChEBML_91950
IC50 260±n/a nM
Citation Adams, CAldous, DJAmendola, SBamborough, PBright, CCrowe, SEastwood, PFenton, GFoster, MHarrison, TKKing, SLai, JLawrence, CLetallec, JPMcCarthy, CMoorcroft, NPage, KRao, SRedford, JSadiq, SSmith, KSouness, JEThurairatnam, SVine, MWyman, B Mapping the kinase domain of Janus Kinase 3. Bioorg Med Chem Lett13:3105-10 (2003) Tyrosine-protein kinase JAK3
Name:Tyrosine-protein kinase JAK3
Type:Protein
Mol. Mass.:125111.08
Organism:Homo sapiens (Human)
Description:P52333
Residue:1124
BDBM50132424
NameBDBM50132424
Synonyms:3-[2-Oxo-2-(1H-pyrrol-2-yl)-eth-(Z)-ylidene]-5-(thiophene-2-carbonyl)-1,3-dihydro-indol-2-one | CHEMBL106961
TypeSmall organic molecule
Emp. Form.C19H12N2O3S
Mol. Mass.348.375
SMILESO=C(\C=C1/C(=O)Nc2ccc(cc12)C(=O)c1cccs1)c1ccc[nH]1