Reaction Details
TargetTyrosine-protein kinase JAK3
LigandBDBM50132427
Substrate/Competitorn/a
Meas. Tech.ChEBML_91950
IC50 30±n/a nM
Citation Adams, CAldous, DJAmendola, SBamborough, PBright, CCrowe, SEastwood, PFenton, GFoster, MHarrison, TKKing, SLai, JLawrence, CLetallec, JPMcCarthy, CMoorcroft, NPage, KRao, SRedford, JSadiq, SSmith, KSouness, JEThurairatnam, SVine, MWyman, B Mapping the kinase domain of Janus Kinase 3. Bioorg Med Chem Lett13:3105-10 (2003) Tyrosine-protein kinase JAK3
Name:Tyrosine-protein kinase JAK3
Type:Protein
Mol. Mass.:125111.08
Organism:Homo sapiens (Human)
Description:P52333
Residue:1124
BDBM50132427
NameBDBM50132427
Synonyms:5-Pyridin-3-yl-3-[1-(1H-pyrrol-2-yl)-meth-(Z)-ylidene]-1,3-dihydro-pyrrolo[2,3-c]pyridin-2-one | CHEMBL106571
TypeSmall organic molecule
Emp. Form.C17H12N4O
Mol. Mass.288.3034
SMILESO=C1Nc2cnc(cc2\C1=C\c1ccc[nH]1)-c1cccnc1