Reaction Details
TargetTyrosine-protein kinase JAK3
LigandBDBM50132429
Substrate/Competitorn/a
Meas. Tech.ChEBML_91950
IC50 870.0±n/a nM
Citation Adams, CAldous, DJAmendola, SBamborough, PBright, CCrowe, SEastwood, PFenton, GFoster, MHarrison, TKKing, SLai, JLawrence, CLetallec, JPMcCarthy, CMoorcroft, NPage, KRao, SRedford, JSadiq, SSmith, KSouness, JEThurairatnam, SVine, MWyman, B Mapping the kinase domain of Janus Kinase 3. Bioorg Med Chem Lett13:3105-10 (2003) Tyrosine-protein kinase JAK3
Name:Tyrosine-protein kinase JAK3
Type:Protein
Mol. Mass.:125111.08
Organism:Homo sapiens (Human)
Description:P52333
Residue:1124
BDBM50132429
NameBDBM50132429
Synonyms:CHEMBL104409 | N-{2-Oxo-3-[1-(1H-pyrrol-2-yl)-meth-(Z)-ylidene]-2,3-dihydro-1H-indol-5-yl}-benzamide
TypeSmall organic molecule
Emp. Form.C20H15N3O2
Mol. Mass.329.352
SMILESO=C(Nc1ccc2NC(=O)\C(=C/c3ccc[nH]3)c2c1)c1ccccc1