Reaction Details
TargetCalcium/calmodulin-dependent protein kinase type II subunit alpha/beta/delta/gamma
LigandBDBM2672
Substrate/Competitorn/a
Meas. Tech.ChEMBL_43104 (CHEMBL657561)
IC50 25±n/a nM
Citation Sanchez-Martinez, CShih, CFaul, MMZhu, GPaal, MSomoza, CLi, TKumrich, CAWinneroski, LLXun, ZBrooks, HBPatel, BKSchultz, RMDeHahn, TBSpencer, CDWatkins, SAConsidine, EDempsey, JAOgg, CACampbell, RMAnderson, BAWagner, J Aryl[a]pyrrolo[3,4-c]carbazoles as selective cyclin D1-CDK4 inhibitors. Bioorg Med Chem Lett13:3835-9 (2003) Calcium/calmodulin-dependent protein kinase type II subunit alpha/beta/delta/gamma
Name:Calcium/calmodulin-dependent protein kinase type II subunit alpha/beta/delta/gamma
Synonyms:CaM kinase II
Type:n/a
Mol. Mass.:n/a
Description:ASSAY_ID of ChEMBL is 368599
Components:This complex has 4 components.
Component 1
Name:Calcium/calmodulin-dependent protein kinase type II subunit alpha
Type:Enzyme Catalytic Domain
Mol. Mass.:54093.63
Organism:Homo sapiens (Human)
Description:gi_25952118
Residue:478
Component 2
Name:Calcium/calmodulin-dependent protein kinase type II subunit gamma
Synonyms:2.7.11.17 CAMK-II CAMKG CaM kinase II gamma CaMK-II subunit gamma Calcium/calmodulin-dependent protein kinase type II subunit gamma (CAMKllg) | KCC2G_HUMAN
Type:Protein
Mol. Mass.:62621.56
Organism:Homo sapiens (Human)
Description:Q13555
Residue:558
Component 3
Name:Calcium/calmodulin-dependent protein kinase type II subunit beta
Synonyms:CAM2 CAMK2B CaM kinase II CaM kinase II subunit beta CaMK-II subunit beta Calcium/calmodulin-dependent protein kinase type II beta chain | KCC2B_HUMAN
Type:Enzyme Catalytic Domain
Mol. Mass.:72685.48
Organism:Homo sapiens (Human)
Description:gi_26051204
Residue:666
Component 4
Name:Calcium/calmodulin-dependent protein kinase type II subunit delta
Synonyms:CAMK2D CaM kinase II CaMK-II subunit delta Calcium/calmodulin-dependent protein kinase type II subunit delta (CAMK2D) KCC2D_HUMAN
Type:Enzyme Catalytic Domain
Mol. Mass.:56419.78
Organism:Homo sapiens (Human)
Description:Q13557
Residue:499
BDBM2672
NameBDBM2672
Synonyms:3,13,23-triazahexacyclo[14.7.0.0^{2,10}.0^{4,9}.0^{11,15}.0^{17,22}]tricosa-1(16),2(10),4(9),5,7,11(15),17(22),18,20-nonaene-12,14-dione CHEMBL268368 | arcyriaflavin A
TypeSmall organic molecule
Emp. Form.C20H11N3O2
Mol. Mass.325.3202
SMILESO=C1NC(=O)c2c1c1c3ccccc3[nH]c1c1[nH]c3ccccc3c21