Reaction Details
TargetBeta-2 adrenergic receptor
LigandBDBM50569861
Substrate/Competitorn/a
Meas. Tech.ChEMBL_2110679 (CHEMBL4819529)
EC50 0.020000±n/a nM
Citation Xing, GWoo, AYPan, LLin, BCheng, MS Recent Advances in ? J Med Chem63:15218-15242 (2020) 
 
Beta-2 adrenergic receptor
Name:Beta-2 adrenergic receptor
Type:n/a
Mol. Mass.:46461.69
Organism:Homo sapiens (Human)
Description:P07550
Residue:413
BDBM50569861
NameBDBM50569861
Synonyms:BI 1744 Olodaterol | Striverdi respimat
TypeSmall organic molecule
Emp. Form.C21H26N2O5
Mol. Mass.386.4415
SMILESCOc1ccc(CC(C)(C)NC[C@H](O)c2cc(O)cc3NC(=O)COc23)cc1