Reaction Details
TargetDual specificity protein kinase TTK
LigandBDBM50569974
Substrate/Competitorn/a
Meas. Tech.ChEMBL_2110865 (CHEMBL4819715)
Kd 0.720000±n/a nM
Citation Huang, MHuang, YGuo, JYu, LChang, YWang, XLuo, JHuang, YTu, ZLu, XXu, YZhang, ZZhang, ZDing, K Pyrido[2, 3-d]pyrimidin-7(8H)-ones as new selective orally bioavailable Threonine Tyrosine Kinase (TTK) inhibitors. Eur J Med Chem211:0 (2021) 
 
Dual specificity protein kinase TTK
Name:Dual specificity protein kinase TTK
Type:Protein
Mol. Mass.:97086.79
Organism:Homo sapiens (Human)
Description:P33981
Residue:857
BDBM50569974
NameBDBM50569974
Synonyms:CHEMBL4861308
TypeSmall organic molecule
Emp. Form.C28H37N7O3
Mol. Mass.519.6385
SMILESCOc1cc(ccc1Nc1ncc2c(C)cc(=O)n([C@@H]3CC[C@@H](CC3)NC(C)=O)c2n1)N1CCN(C)CC1