Reaction Details
TargetDual specificity protein kinase TTK
LigandBDBM50569982
Substrate/Competitorn/a
Meas. Tech.ChEMBL_2110865 (CHEMBL4819715)
Kd 1.1±n/a nM
Citation Huang, MHuang, YGuo, JYu, LChang, YWang, XLuo, JHuang, YTu, ZLu, XXu, YZhang, ZZhang, ZDing, K Pyrido[2, 3-d]pyrimidin-7(8H)-ones as new selective orally bioavailable Threonine Tyrosine Kinase (TTK) inhibitors. Eur J Med Chem211:0 (2021) 
 
Dual specificity protein kinase TTK
Name:Dual specificity protein kinase TTK
Type:Protein
Mol. Mass.:97086.79
Organism:Homo sapiens (Human)
Description:P33981
Residue:857
BDBM50569982
NameBDBM50569982
Synonyms:CHEMBL4859914
TypeSmall organic molecule
Emp. Form.C37H41N7O3
Mol. Mass.631.7665
SMILESCOc1cc(ccc1Nc1ncc2c(C)cc(=O)n([C@@H]3CC[C@@H](CC3)NC(=O)c3cccc4ccccc34)c2n1)N1CCN(C)CC1