Reaction Details
TargetDual specificity protein kinase TTK
LigandBDBM50569991
Substrate/Competitorn/a
Meas. Tech.ChEMBL_2110865 (CHEMBL4819715)
Kd 0.071000±n/a nM
Citation Huang, MHuang, YGuo, JYu, LChang, YWang, XLuo, JHuang, YTu, ZLu, XXu, YZhang, ZZhang, ZDing, K Pyrido[2, 3-d]pyrimidin-7(8H)-ones as new selective orally bioavailable Threonine Tyrosine Kinase (TTK) inhibitors. Eur J Med Chem211:0 (2021) 
 
Dual specificity protein kinase TTK
Name:Dual specificity protein kinase TTK
Type:Protein
Mol. Mass.:97086.79
Organism:Homo sapiens (Human)
Description:P33981
Residue:857
BDBM50569991
NameBDBM50569991
Synonyms:CHEMBL4877547
TypeSmall organic molecule
Emp. Form.C29H31N5O3
Mol. Mass.497.5881
SMILESCc1cc(ccc1C(=O)NC1CC1)-c1cnn2c(CC[C@H]3C[C@@](C)(O)C3)cc(Oc3cccnc3)nc12