Reaction Details
TargetTyrosine-protein kinase Lck
LigandBDBM13253
Substrate/Competitorn/a
Meas. Tech.ChEBML_39723
IC50 3100±n/a nM
Citation Wityak, JDas, JMoquin, RVShen, ZLin, JChen, PDoweyko, AMPitt, SPang, SShen, DRFang, Qde Fex, HFSchieven, GLKanner, SBBarrish, JC Discovery and initial SAR of 2-amino-5-carboxamidothiazoles as inhibitors of the Src-family kinase p56(Lck). Bioorg Med Chem Lett13:4007-10 (2003) Tyrosine-protein kinase Lck
Name:Tyrosine-protein kinase Lck
Type:n/a
Mol. Mass.:57987.83
Organism:Homo sapiens (Human)
Description:P06239
Residue:509
BDBM13253
NameBDBM13253
Synonyms:5-N-(2-chloro-6-methylphenyl)-2-N-(furan-2-)-1,3-thiazole-2,5-diamido CHEMBL128070 | N-(2-Chloro-6-methylphenyl)-2-[(2-furanylcarbonyl)amino]-1,3-thiazole-5-carboxamide
TypeSmall organic molecule
Emp. Form.C16H12ClN3O3S
Mol. Mass.361.803
SMILESCc1cccc(Cl)c1NC(=O)c1cnc(NC(=O)c2ccco2)s1