Reaction Details
TargetTyrosine-protein kinase Lck
LigandBDBM13219
Substrate/Competitorn/a
Meas. Tech.ChEMBL_221335 (CHEMBL841397)
IC50 4400±n/a nM
Citation Wityak, JDas, JMoquin, RVShen, ZLin, JChen, PDoweyko, AMPitt, SPang, SShen, DRFang, Qde Fex, HFSchieven, GLKanner, SBBarrish, JC Discovery and initial SAR of 2-amino-5-carboxamidothiazoles as inhibitors of the Src-family kinase p56(Lck). Bioorg Med Chem Lett13:4007-10 (2003) Tyrosine-protein kinase Lck
Name:Tyrosine-protein kinase Lck
Type:n/a
Mol. Mass.:57987.83
Organism:Homo sapiens (Human)
Description:P06239
Residue:509
BDBM13219
NameBDBM13219
Synonyms:2-[[(tert-Butyloxy)carbonyl]-amino]-4-methyl-N-(2,6-dimethylphenyl)-1,3-thiazole-5-carboxamide CHEMBL129454 | tert-butyl N-{5-[(2,6-dimethylphenyl)carbamoyl]-4-methyl-1,3-thiazol-2-yl}carbamate
TypeSmall organic molecule
Emp. Form.C18H23N3O3S
Mol. Mass.361.459
SMILESCc1nc(NC(=O)OC(C)(C)C)sc1C(=O)Nc1c(C)cccc1C