Reaction Details
TargetProto-oncogene tyrosine-protein kinase LCK
LigandBDBM50135398
Substrate/Competitorn/a
Meas. Tech.ChEBML_221476
IC50>50000±n/a nM
Citation Wityak, JDas, JMoquin, RVShen, ZLin, JChen, PDoweyko, AMPitt, SPang, SShen, DRFang, Qde Fex, HFSchieven, GLKanner, SBBarrish, JC Discovery and initial SAR of 2-amino-5-carboxamidothiazoles as inhibitors of the Src-family kinase p56(Lck). Bioorg Med Chem Lett13:4007-10 (2003) Proto-oncogene tyrosine-protein kinase LCK
Name:Proto-oncogene tyrosine-protein kinase LCK
Type:PROTEIN
Mol. Mass.:57927.84
Organism:Mus musculus
Description:ChEMBL_806408
Residue:509
BDBM50135398
NameBDBM50135398
Synonyms:CHEMBL423516 | [4-Methyl-5-(2-nitro-phenylcarbamoyl)-thiazol-2-yl]-carbamic acid tert-butyl ester
TypeSmall organic molecule
Emp. Form.C16H18N4O5S
Mol. Mass.378.403
SMILESCc1nc(NC(=O)OC(C)(C)C)sc1C(=O)Nc1ccccc1[N+]([O-])=O