Reaction Details
TargetTyrosine-protein kinase Lck
LigandBDBM13245
Substrate/Competitorn/a
Meas. Tech.ChEBML_39723
IC50 620±n/a nM
Citation Wityak, JDas, JMoquin, RVShen, ZLin, JChen, PDoweyko, AMPitt, SPang, SShen, DRFang, Qde Fex, HFSchieven, GLKanner, SBBarrish, JC Discovery and initial SAR of 2-amino-5-carboxamidothiazoles as inhibitors of the Src-family kinase p56(Lck). Bioorg Med Chem Lett13:4007-10 (2003) Tyrosine-protein kinase Lck
Name:Tyrosine-protein kinase Lck
Type:n/a
Mol. Mass.:57987.83
Organism:Homo sapiens (Human)
Description:P06239
Residue:509
BDBM13245
NameBDBM13245
Synonyms:2-[(butylcarbamoyl)amino]-N-(2-chloro-6-methylphenyl)-4-methyl-1,3-thiazole-5-carboxamide BMS-354825 2-Amino-4-methyl-thiazole Analog 8f | CHEMBL130160
TypeSmall organic molecule
Emp. Form.C17H21ClN4O2S
Mol. Mass.380.892
SMILESCCCCNC(=O)Nc1nc(C)c(s1)C(=O)Nc1c(C)cccc1Cl