Reaction Details
TargetGlycogen phosphorylase, muscle form
LigandBDBM50135563
Substrate/Competitorn/a
Meas. Tech.ChEBML_70984
IC50 167±n/a nM
Citation Lu, ZBohn, JBergeron, RDeng, QEllsworth, KPGeissler, WMHarris, GMcCann, PEMcKeever, BMyers, RWSaperstein, RWilloughby, CAYao, JChapman, K A new class of glycogen phosphorylase inhibitors. Bioorg Med Chem Lett13:4125-8 (2003) Glycogen phosphorylase, muscle form
Name:Glycogen phosphorylase, muscle form
Type:PROTEIN
Mol. Mass.:97097.45
Organism:Homo sapiens (Human)
Description:ChEMBL_1449751
Residue:842
BDBM50135563
NameBDBM50135563
Synonyms:4-{2-[(4-Cyano-pyridine-2-carbonyl)-amino]-phenoxy}-phthalic acid | CHEMBL132201
TypeSmall organic molecule
Emp. Form.C21H13N3O6
Mol. Mass.403.3444
SMILESOC(=O)c1ccc(Oc2ccccc2NC(=O)c2cc(ccn2)C#N)cc1C(O)=O