Reaction Details
TargetProstaglandin G/H synthase 2
LigandBDBM50136107
Substrate/Competitorn/a
Meas. Tech.ChEMBL_159732 (CHEMBL766189)
IC50 1000±n/a nM
Citation Khanapure, SPGarvey, DSYoung, DVEzawa, MEarl, RAGaston, RDFang, XMurty, MMartino, AShumway, MTrocha, MMarek, PTam, SWJanero, DRLetts, LG Synthesis and structure-activity relationship of novel, highly potent metharyl and methcycloalkyl cyclooxygenase-2 (COX-2) selective inhibitors. J Med Chem46:5484-504 (2003) 
 
Prostaglandin G/H synthase 2
Name:Prostaglandin G/H synthase 2
Type:Enzyme
Mol. Mass.:69003.89
Organism:Homo sapiens (Human)
Description:Recombinant Cox-2 provided by Cayman (Cayman Chemical Co.,Ann Arbor, MI).
Residue:604
BDBM50136107
NameBDBM50136107
Synonyms:(3-Fluoro-phenyl)-[6-(4-methanesulfonyl-phenyl)-benzo[1,3]dioxol-5-yl]-methanone | CHEMBL153767
TypeSmall organic molecule
Emp. Form.C21H15FO5S
Mol. Mass.398.404
SMILESCS(=O)(=O)c1ccc(cc1)-c1cc2OCOc2cc1C(=O)c1cccc(F)c1