Reaction Details
TargetC-C chemokine receptor type 5
LigandBDBM50141937
Substrate/Competitorn/a
Meas. Tech.ChEBML_44691
IC50 0.200000±n/a nM
Citation Shu, MLoebach, JLParker, KAMills, SGChapman, KTShen, DMMalkowitz, LSpringer, MSGould, SLDeMartino, JASiciliano, SJSalvo, JDLyons, KPivnichny, JVKwei, GYCarella, ACarver, GHolmes, KSchleif, WADanzeisen, RHazuda, DKessler, JLineberger, JMiller, MDEmini, EA Antagonists of human CCR5 receptor containing 4-(pyrazolyl)piperidine side chains. Part 3: SAR studies on the benzylpyrazole segment. Bioorg Med Chem Lett14:947-52 (2004) 
 
C-C chemokine receptor type 5
Name:C-C chemokine receptor type 5
Type:Enzyme
Mol. Mass.:40540.21
Organism:Homo sapiens (Human)
Description:P51681
Residue:352
BDBM50141937
NameBDBM50141937
Synonyms:(2R,4R)-2-[(2S,3S)-3-[4-(2-Ethyl-5-naphthalen-2-ylmethyl-2H-pyrazol-3-yl)-piperidin-1-ylmethyl]-4-(3-fluoro-phenyl)-pyrrolidin-1-yl]-3-methyl-pentanoic acid | CHEMBL173400
TypeSmall organic molecule
Emp. Form.C38H47FN4O2
Mol. Mass.610.8038
SMILESCC[C@@H](C)[C@@H](N1C[C@H](CN2CCC(CC2)c2cc(Cc3ccc4ccccc4c3)nn2CC)[C@H](C1)c1cccc(F)c1)C(O)=O