Reaction Details
TargetC-C chemokine receptor type 5
LigandBDBM50143756
Substrate/Competitorn/a
Meas. Tech.ChEMBL_39506 (CHEMBL654035)
IC50 1±n/a nM
Citation Thoma, GNuninger, FSchaefer, MAkyel, KGAlbert, RBeerli, CBruns, CFrancotte, ELuyten, MMacKenzie, DOberer, LStreiff, MBWagner, TWalter, HWeckbecker, GZerwes, HG Orally bioavailable competitive CCR5 antagonists. J Med Chem47:1939-55 (2004) 
 
C-C chemokine receptor type 5
Name:C-C chemokine receptor type 5
Type:Enzyme
Mol. Mass.:40540.21
Organism:Homo sapiens (Human)
Description:P51681
Residue:352
BDBM50143756
NameBDBM50143756
Synonyms:(4,6-Dimethyl-pyrimidin-5-yl)-(4-diphenylamino-4'-methyl-[1,4']bipiperidinyl-1'-yl)-methanone CHEMBL61424
TypeSmall organic molecule
Emp. Form.C30H37N5O
Mol. Mass.483.6477
SMILESCc1ncnc(C)c1C(=O)N1CCC(C)(CC1)N1CCC(CC1)N(c1ccccc1)c1ccccc1