Reaction Details
TargetcGMP-specific 3',5'-cyclic phosphodiesterase
LigandBDBM15297
Substrate/Competitorn/a
Meas. Tech.ChEBML_155210
IC50 7150±n/a nM
Citation Pitts, WJVaccaro, WHuynh, TLeftheris, KRoberge, JYBarbosa, JGuo, JBrown, BWatson, ADonaldson, KStarling, GCKiener, PAPoss, MADodd, JHBarrish, JC Identification of purine inhibitors of phosphodiesterase 7 (PDE7). Bioorg Med Chem Lett14:2955-8 (2004) 
 
cGMP-specific 3',5'-cyclic phosphodiesterase
Name:cGMP-specific 3',5'-cyclic phosphodiesterase
Type:Protein
Mol. Mass.:99975.83
Organism:Homo sapiens (Human)
Description:O76074
Residue:875
BDBM15297
NameBDBM15297
Synonyms:CHEMBL34431 N-Cyclohexyl-N-methyl-4-(2-oxo-1,2-dihydro-quinolin-6-yloxy)-butyramide | N-cyclohexyl-N-methyl-4-[(2-oxo-1,2-dihydroquinolin-6-yl)oxy]butanamide
TypeSmall organic molecule
Emp. Form.C20H26N2O3
Mol. Mass.342.432
SMILESCN(C1CCCCC1)C(=O)CCCOc1ccc2[nH]c(=O)ccc2c1