Reaction Details
TargetMethionine--tRNA ligase
LigandBDBM50149627
Substrate/Competitorn/a
Meas. Tech.ChEMBL_305245 (CHEMBL833503)
IC50 17±n/a nM
Citation Jarvest, RLArmstrong, SABerge, JMBrown, PElder, JSBrown, MJCopley, RCForrest, AKHamprecht, DWO'Hanlon, PJMitchell, DJRittenhouse, SWitty, DR Definition of the heterocyclic pharmacophore of bacterial methionyl tRNA synthetase inhibitors: potent antibacterially active non-quinolone analogues. Bioorg Med Chem Lett14:3937-41 (2004) 
 
Methionine--tRNA ligase
Name:Methionine--tRNA ligase
Type:PROTEIN
Mol. Mass.:74852.92
Organism:Staphylococcus aureus (strain MW2)
Description:ChEMBL_305245
Residue:657
BDBM50149627
NameBDBM50149627
Synonyms:CHEMBL180309 | N-(1H-Benzoimidazol-2-yl)-N''-(3,5-dibromo-2-ethoxy-benzyl)-propane-1,3-diamine
TypeSmall organic molecule
Emp. Form.C19H22Br2N4O
Mol. Mass.482.212
SMILESCCOc1c(Br)cc(Br)cc1CNCCCNc1nc2ccccc2[nH]1