Reaction Details
TargetMethionine--tRNA ligase
LigandBDBM50149639
Substrate/Competitorn/a
Meas. Tech.ChEMBL_305245 (CHEMBL833503)
IC50 16±n/a nM
Citation Jarvest, RLArmstrong, SABerge, JMBrown, PElder, JSBrown, MJCopley, RCForrest, AKHamprecht, DWO'Hanlon, PJMitchell, DJRittenhouse, SWitty, DR Definition of the heterocyclic pharmacophore of bacterial methionyl tRNA synthetase inhibitors: potent antibacterially active non-quinolone analogues. Bioorg Med Chem Lett14:3937-41 (2004) 
 
Methionine--tRNA ligase
Name:Methionine--tRNA ligase
Type:PROTEIN
Mol. Mass.:74852.92
Organism:Staphylococcus aureus (strain MW2)
Description:ChEMBL_305245
Residue:657
BDBM50149639
NameBDBM50149639
Synonyms:CHEMBL183110 | N-(1H-Benzoimidazol-2-yl)-N''-(6-ethyl-8-iodo-1,2,3,4-tetrahydro-quinolin-4-yl)-propane-1,3-diamine
TypeSmall organic molecule
Emp. Form.C21H26IN5
Mol. Mass.475.3691
SMILESCCc1cc(I)c2NCCC(NCCCNc3nc4ccccc4[nH]3)c2c1