Reaction Details
TargetProstaglandin G/H synthase 1
LigandBDBM22369
Substrate/Competitorn/a
Meas. Tech.ChEMBL_305401 (CHEMBL833051)
IC50>100000±n/a nM
Citation Beswick, PBingham, SBountra, CBrown, TBrowning, KCampbell, IChessell, IClayton, NCollins, SCorfield, JGuntrip, SHaslam, CLambeth, PLucas, FMathews, NMurkit, GNaylor, APegg, NPickup, EPlayer, HPrice, HStevens, AStratton, SWiseman, J Identification of 2,3-diaryl-pyrazolo[1,5-b]pyridazines as potent and selective cyclooxygenase-2 inhibitors. Bioorg Med Chem Lett14:5445-8 (2004) 
 
Prostaglandin G/H synthase 1
Name:Prostaglandin G/H synthase 1
Type:Enzyme
Mol. Mass.:68692.62
Organism:Homo sapiens (Human)
Description:P23219
Residue:599
BDBM22369
NameBDBM22369
Synonyms:4-(4-methanesulfonylphenyl)-3-phenyl-2,5-dihydrofuran-2-one MK 0966 US11478464, Compound Rofecoxib | US11786535, Compound Rofecoxib
TypeSmall organic molecule
Emp. Form.C17H14O4S
Mol. Mass.314.356
SMILESCS(=O)(=O)c1ccc(cc1)C1=C(C(=O)OC1)c1ccccc1