Reaction Details
TargetBeta-2 adrenergic receptor
LigandBDBM50156247
Substrate/Competitorn/a
Meas. Tech.ChEMBL_310530 (CHEMBL833519)
EC50 7.7±n/a nM
Citation Mizuno, KSawa, MHarada, HTateishi, HOue, MTsujiuchi, HFurutani, YKato, S Tryptamine-based human beta3-adrenergic receptor agonists. Part 1: SAR studies of the 7-position of the indole ring. Bioorg Med Chem Lett14:5959-62 (2004) 
 
Beta-2 adrenergic receptor
Name:Beta-2 adrenergic receptor
Type:n/a
Mol. Mass.:46461.69
Organism:Homo sapiens (Human)
Description:P07550
Residue:413
BDBM50156247
NameBDBM50156247
Synonyms:CHEMBL186196 | Thiophene-2-sulfonic acid (3-{(R)-2-[(R)-2-(7-ethoxy-1H-indol-3-yl)-1-methyl-ethylamino]-1-hydroxy-ethyl}-phenyl)-amide
TypeSmall organic molecule
Emp. Form.C25H29N3O4S2
Mol. Mass.499.645
SMILESCCOc1cccc2c(C[C@@H](C)NC[C@H](O)c3cccc(NS(=O)(=O)c4cccs4)c3)c[nH]c12