Reaction Details
TargetBeta-2 adrenergic receptor
LigandBDBM50156261
Substrate/Competitorn/a
Meas. Tech.ChEMBL_310530 (CHEMBL833519)
EC50 1.2±n/a nM
Citation Mizuno, KSawa, MHarada, HTateishi, HOue, MTsujiuchi, HFurutani, YKato, S Tryptamine-based human beta3-adrenergic receptor agonists. Part 1: SAR studies of the 7-position of the indole ring. Bioorg Med Chem Lett14:5959-62 (2004) 
 
Beta-2 adrenergic receptor
Name:Beta-2 adrenergic receptor
Type:n/a
Mol. Mass.:46461.69
Organism:Homo sapiens (Human)
Description:P07550
Residue:413
BDBM50156261
NameBDBM50156261
Synonyms:CHEMBL186271 | Thiophene-2-sulfonic acid 3-(2-{(R)-(R)-2-hydroxy-2-[3-(thiophene-2-sulfonylamino)-phenyl]-ethylamino}-propyl)-1H-indol-7-yl ester
TypeSmall organic molecule
Emp. Form.C27H27N3O6S4
Mol. Mass.617.78
SMILESC[C@H](Cc1c[nH]c2c(OS(=O)(=O)c3cccs3)cccc12)NC[C@H](O)c1cccc(NS(=O)(=O)c2cccs2)c1