Reaction Details
TargetBeta-2 adrenergic receptor
LigandBDBM50156260
Substrate/Competitorn/a
Meas. Tech.ChEMBL_303401 (CHEMBL839158)
Ki 48±n/a nM
Citation Mizuno, KSawa, MHarada, HTateishi, HOue, MTsujiuchi, HFurutani, YKato, S Tryptamine-based human beta3-adrenergic receptor agonists. Part 1: SAR studies of the 7-position of the indole ring. Bioorg Med Chem Lett14:5959-62 (2004) 
 
Beta-2 adrenergic receptor
Name:Beta-2 adrenergic receptor
Type:n/a
Mol. Mass.:46461.69
Organism:Homo sapiens (Human)
Description:P07550
Residue:413
BDBM50156260
NameBDBM50156260
Synonyms:CHEMBL184407 | Methanesulfonic acid 3-(2-{(R)-(R)-2-hydroxy-2-[3-(thiophene-2-sulfonylamino)-phenyl]-ethylamino}-propyl)-1H-indol-7-yl ester
TypeSmall organic molecule
Emp. Form.C24H27N3O6S3
Mol. Mass.549.683
SMILESC[C@H](Cc1c[nH]c2c(OS(C)(=O)=O)cccc12)NC[C@H](O)c1cccc(NS(=O)(=O)c2cccs2)c1