Reaction Details
TargetBeta-1 adrenergic receptor
LigandBDBM50156250
Substrate/Competitorn/a
Meas. Tech.ChEMBL_303399 (CHEMBL840062)
Ki 43±n/a nM
Citation Mizuno, KSawa, MHarada, HTateishi, HOue, MTsujiuchi, HFurutani, YKato, S Tryptamine-based human beta3-adrenergic receptor agonists. Part 1: SAR studies of the 7-position of the indole ring. Bioorg Med Chem Lett14:5959-62 (2004) 
 
Beta-1 adrenergic receptor
Name:Beta-1 adrenergic receptor
Type:G Protein-Coupled Receptor (GPCR)
Mol. Mass.:51338.40
Organism:Homo sapiens (Human)
Description:P08588
Residue:477
BDBM50156250
NameBDBM50156250
Synonyms:CHEMBL361505 | Thiophene-2-sulfonic acid (3-{(R)-1-hydroxy-2-[(R)-2-(7-methoxy-1H-indol-3-yl)-1-methyl-ethylamino]-ethyl}-phenyl)-amide
TypeSmall organic molecule
Emp. Form.C24H27N3O4S2
Mol. Mass.485.619
SMILESCOc1cccc2c(C[C@@H](C)NC[C@H](O)c3cccc(NS(=O)(=O)c4cccs4)c3)c[nH]c12