Reaction Details
TargetBeta-3 adrenergic receptor
LigandBDBM50156252
Substrate/Competitorn/a
Meas. Tech.ChEMBL_303403 (CHEMBL839160)
Ki 30±n/a nM
Citation Mizuno, KSawa, MHarada, HTateishi, HOue, MTsujiuchi, HFurutani, YKato, S Tryptamine-based human beta3-adrenergic receptor agonists. Part 1: SAR studies of the 7-position of the indole ring. Bioorg Med Chem Lett14:5959-62 (2004) 
 
Beta-3 adrenergic receptor
Name:Beta-3 adrenergic receptor
Type:G Protein-Coupled Receptor (GPCR)
Mol. Mass.:43534.88
Organism:Homo sapiens (Human)
Description:n/a
Residue:408
BDBM50156252
NameBDBM50156252
Synonyms:CHEMBL185836 | Thiophene-2-sulfonic acid (3-{(R)-1-hydroxy-2-[(R)-2-(1H-indol-3-yl)-1-methyl-ethylamino]-ethyl}-phenyl)-amide
TypeSmall organic molecule
Emp. Form.C23H25N3O3S2
Mol. Mass.455.593
SMILESC[C@H](Cc1c[nH]c2ccccc12)NC[C@H](O)c1cccc(NS(=O)(=O)c2cccs2)c1