Reaction Details
TargetBeta-1 adrenergic receptor
LigandBDBM50156258
Substrate/Competitorn/a
Meas. Tech.ChEMBL_303399 (CHEMBL840062)
EC50 40±n/a nM
Citation Mizuno, KSawa, MHarada, HTateishi, HOue, MTsujiuchi, HFurutani, YKato, S Tryptamine-based human beta3-adrenergic receptor agonists. Part 1: SAR studies of the 7-position of the indole ring. Bioorg Med Chem Lett14:5959-62 (2004) 
 
Beta-1 adrenergic receptor
Name:Beta-1 adrenergic receptor
Type:G Protein-Coupled Receptor (GPCR)
Mol. Mass.:51338.40
Organism:Homo sapiens (Human)
Description:P08588
Residue:477
BDBM50156258
NameBDBM50156258
Synonyms:CHEMBL185660 | Propane-2-sulfonic acid 3-(2-{(R)-(R)-2-hydroxy-2-[3-(thiophene-2-sulfonylamino)-phenyl]-ethylamino}-propyl)-1H-indol-7-yl ester
TypeSmall organic molecule
Emp. Form.C26H31N3O6S3
Mol. Mass.577.736
SMILESC[C@H](Cc1c[nH]c2c(OS(=O)(=O)C(C)C)cccc12)NC[C@H](O)c1cccc(NS(=O)(=O)c2cccs2)c1