Reaction Details
TargetBeta-2 adrenergic receptor
LigandBDBM50156278
Substrate/Competitorn/a
Meas. Tech.ChEMBL_303402 (CHEMBL839159)
Ki 20±n/a nM
Citation Sawa, MTateishi, HMizuno, KHarada, HOue, MTsujiuchi, HFurutani, YKato, S Tryptamine-based human beta3-adrenergic receptor agonists. Part 2: SAR of the methylene derivatives. Bioorg Med Chem Lett14:5963-6 (2004) 
 
Beta-2 adrenergic receptor
Name:Beta-2 adrenergic receptor
Type:n/a
Mol. Mass.:46461.69
Organism:Homo sapiens (Human)
Description:P07550
Residue:413
BDBM50156278
NameBDBM50156278
Synonyms:3-Amino-N-(3-{(R)-1-hydroxy-2-[(R)-2-(7-methanesulfonyl-1H-indol-3-yl)-1-methyl-ethylamino]-ethyl}-phenyl)-benzenesulfonamide | CHEMBL442225
TypeSmall organic molecule
Emp. Form.C26H30N4O5S2
Mol. Mass.542.67
SMILESC[C@H](Cc1c[nH]c2c(cccc12)S(C)(=O)=O)NC[C@H](O)c1cccc(NS(=O)(=O)c2cccc(N)c2)c1